Target
Histidine kinase
Ligand
BDBM50453884
Substrate
Meas. Tech.
ChEMBL_1751472 (CHEMBL4186232)
IC50
32700±n/a nM
Citation
 Vo, CDShebert, HLZikovich, SDryer, RAHuang, TPMoran, LJCho, JWassarman, DRFalahee, BEYoung, PDGu, GHHeinl, JFHammond, JWJackvony, TNFrederick, TEBlair, JA Repurposing Hsp90 inhibitors as antibiotics targeting histidine kinases. Bioorg Med Chem Lett 27:5235-5244 (2017)  
Target
Name:
Histidine kinase
Synonyms:
Cell cycle histidine kinase CckA | cckA
Type:
PROTEIN
Mol. Mass.:
73062.72
Organism:
Caulobacter vibrioides
Description:
ChEMBL_117872
Residue:
691
  
Inhibitor
Name:
BDBM50453884
Synonyms:
CHEMBL4217100
Type:
Small organic molecule
Emp. Form.:
C16H13ClN2O3
Mol. Mass.:
316.739
SMILES:
COc1ccc(cc1)-c1c[nH]nc1-c1cc(Cl)c(O)cc1O
: