Target
Tyrosine-protein phosphatase non-receptor type 1
Ligand
BDBM50362838
Substrate
Meas. Tech.
ChEMBL_1754336 (CHEMBL4189096)
IC50
41500±n/a nM
Citation
 Zhang, JSasaki, TLi, WNagata, KHigai, KFeng, FWang, JCheng, MKoike, K Identification of caffeoylquinic acid derivatives as natural protein tyrosine phosphatase 1B inhibitors from Artemisia princeps. Bioorg Med Chem Lett 28:1194-1197 (2018)  
Target
Name:
Tyrosine-protein phosphatase non-receptor type 1
Synonyms:
PTN1_HUMAN PTPN1 Protein tyrosine phosphatase-1B (PTP1B) Protein-tyrosine phosphatase 1B (PTP1B) Tyrosine-protein phosphatase non-receptor type 1 (PTP1B)
Type:
Protein phosphatase
Mol. Mass.:
49963.76
Organism:
Homo sapiens (Human)
Description:
Human recombinant GST-fusion PTP1B (1-435).
Residue:
435
  
Inhibitor
Name:
BDBM50362838
Synonyms:
CHEMBL249448
Type:
Small organic molecule
Emp. Form.:
C25H24O12
Mol. Mass.:
516.4509
SMILES:
O[C@@H]1C[C@](O)(C[C@@H](OC(=O)\C=C\c2ccc(O)c(O)c2)[C@@H]1OC(=O)\C=C\c1ccc(O)c(O)c1)C(O)=O
: