Target
Aminopeptidase N
Ligand
BDBM50457465
Substrate
Meas. Tech.
ChEMBL_1759816 (CHEMBL4194824)
Ki
0.600000±n/a nM
Citation
 Amin, SAAdhikari, NJha, T Design of Aminopeptidase N Inhibitors as Anti-cancer Agents. J Med Chem 61:6468-6490 (2018)  
Target
Name:
Aminopeptidase N
Synonyms:
AMPN_PIG AP-M Alanyl aminopeptidase Aminopeptidase N (APN) Microsomal aminopeptidase pAPN
Type:
Protein
Mol. Mass.:
108810.25
Organism:
Sus scrofa (Pig)
Description:
P15145
Residue:
963
  
Inhibitor
Name:
BDBM50457465
Synonyms:
CHEMBL4204736
Type:
Small organic molecule
Emp. Form.:
C22H29N2O5P
Mol. Mass.:
432.4498
SMILES:
CC(N)P(O)(=O)C[C@@H](Cc1ccccc1)C(=O)N[C@@](C)(Cc1ccccc1)C(O)=O
: