Target
DNA gyrase subunit A
Ligand
BDBM21690
Substrate
Meas. Tech.
ChEMBL_1760076 (CHEMBL4195084)
IC50
2600±n/a nM
Citation
 Gerasyuto, AIArnold, MAWang, JChen, GZhang, XSmith, SWoll, MGBaird, JZhang, NAlmstead, NGNarasimhan, JPeddi, SDumble, MSheedy, JWeetall, MBranstrom, AAPrasad, JVNKarp, GM Discovery and Optimization of Indolyl-Containing 4-Hydroxy-2-Pyridone Type II DNA Topoisomerase Inhibitors Active against Multidrug Resistant Gram-negative Bacteria. J Med Chem 61:4456-4475 (2018)  
Target
Name:
DNA gyrase subunit A
Synonyms:
DNA gyrase GYRA_ECOLI hisW parD
Type:
Enzyme Subunit
Mol. Mass.:
96935.15
Organism:
Escherichia coli (strain K12)
Description:
Residue:
875
  
Inhibitor
Name:
BDBM21690
Synonyms:
1-cyclopropyl-6-fluoro-4-oxo-7-(piperazin-1-yl)-1,4-dihydroquinoline-3-carboxylic acid Bay 09867 Ciprinol Ciprofloxacin US9138393, Ciprofloxacin HCl | US9144538, Ciprofloxacin HCl
Type:
Small organic molecule
Emp. Form.:
C17H18FN3O3
Mol. Mass.:
331.3415
SMILES:
OC(=O)c1cn(C2CC2)c2cc(N3CCNCC3)c(F)cc2c1=O
: