Target
Protease
Ligand
BDBM50457611
Substrate
Meas. Tech.
ChEMBL_1760346 (CHEMBL4195354)
Ki
0.002000±n/a nM
Citation
 Ghosh, AKR Nyalapatla, PKovela, SRao, KVBrindisi, MOsswald, HLAmano, MAoki, MAgniswamy, JWang, YFWeber, ITMitsuya, H Design and Synthesis of Highly Potent HIV-1 Protease Inhibitors Containing Tricyclic Fused Ring Systems as Novel P2 Ligands: Structure-Activity Studies, Biological and X-ray Structural Analysis. J Med Chem 61:4561-4577 (2018)  
Target
Name:
Protease
Synonyms:
Type:
Enzyme
Mol. Mass.:
10904.79
Organism:
Human immunodeficiency virus 1 (HIV-1)
Description:
Q9YQ12
Residue:
99
  
Inhibitor
Name:
BDBM50457611
Synonyms:
CHEMBL4214453
Type:
Small organic molecule
Emp. Form.:
C34H42F2N4O7S2
Mol. Mass.:
720.847
SMILES:
[H][C@]12CO[C@]3([H])OCC[C@]([H])([C@@H](C1)OC(=O)N[C@@H](Cc1cc(F)cc(F)c1)[C@H](O)CN(CC(C)C)S(=O)(=O)c1ccc4nc(NC5CC5)sc4c1)[C@]23[H]
: