Target
Histamine H3 receptor
Ligand
BDBM50458234
Substrate
Meas. Tech.
ChEMBL_1762507 (CHEMBL4197754)
Ki
3.9±n/a nM
Citation
 Affini, AHagenow, SZivkovic, AMarco-Contelles, JStark, H Novel indanone derivatives as MAO B/H Eur J Med Chem 148:487-497 (2018)  
Target
Name:
Histamine H3 receptor
Synonyms:
G-protein coupled receptor 97 HH3R HRH3 Histamine H3 receptor (H3) Histamine receptor (H3 and H4)
Type:
G Protein-Coupled Receptor (GPCR)
Mol. Mass.:
48691.47
Organism:
Homo sapiens (Human)
Description:
Binding assays were using CHO cells stably expressing hH3R receptors.
Residue:
445
  
Inhibitor
Name:
BDBM50458234
Synonyms:
CHEMBL4212330
Type:
Small organic molecule
Emp. Form.:
C24H27NO2
Mol. Mass.:
361.4767
SMILES:
O=C1\C(Cc2cc(OCCCN3CCCCC3)ccc12)=C\c1ccccc1
: