Target
Glutathione S-transferase P
Ligand
BDBM50458513
Substrate
Meas. Tech.
ChEMBL_1764009 (CHEMBL4199256)
IC50
500±n/a nM
Citation
 Xie, YDahlin, JLOakley, AJCasarotto, MGBoard, PGBaell, JB Reviewing Hit Discovery Literature for Difficult Targets: Glutathione Transferase Omega-1 as an Example. J Med Chem 61:7448-7470 (2018)  
Target
Name:
Glutathione S-transferase P
Synonyms:
FAEES3 GST3 GSTP1-1 Glutathione S-transferase Glutathione S-transferase P Glutathione transferase (GST)
Type:
Enzyme
Mol. Mass.:
23353.53
Organism:
Homo sapiens (Human)
Description:
P09211
Residue:
210
  
Inhibitor
Name:
BDBM50458513
Synonyms:
Alpha Tocopherol CHEBI:18145 Tocopherol | Vitamin E
Type:
Small organic molecule
Emp. Form.:
C29H50O2
Mol. Mass.:
430.7061
SMILES:
CC(C)CCC[C@@H](C)CCC[C@@H](C)CCC[C@]1(C)CCc2c(C)c(O)c(C)c(C)c2O1
: