Target
Gap junction beta-2 protein
Ligand
BDBM50031282
Substrate
Meas. Tech.
ChEMBL_1764537 (CHEMBL4199784)
IC50
9400±n/a nM
Citation
 AlFindee, MNSubedi, YPFiori, MCKrishnan, SKjellgren, AAltenberg, GAChang, CT Inhibition of Connexin Hemichannels by New Amphiphilic Aminoglycosides without Antibiotic Activity. ACS Med Chem Lett 9:697-701 (2018)  
Target
Name:
Gap junction beta-2 protein
Synonyms:
CXB2_HUMAN Cx26 Gap junction beta-2 protein
Type:
PROTEIN
Mol. Mass.:
26226.37
Organism:
Homo sapiens
Description:
ChEMBL_117983
Residue:
226
  
Inhibitor
Name:
BDBM50031282
Synonyms:
CHEBI:17630 | Kanamycin
Type:
Small organic molecule
Emp. Form.:
C18H36N4O11
Mol. Mass.:
484.4986
SMILES:
NC[C@H]1O[C@H](O[C@@H]2[C@@H](N)C[C@@H](N)[C@H](O[C@H]3O[C@H](CO)[C@@H](O)[C@H](N)[C@H]3O)[C@H]2O)[C@H](O)[C@@H](O)[C@@H]1O
: