Target
Cathepsin D
Ligand
BDBM50022515
Substrate
Meas. Tech.
ChEBML_45183
pH
4±n/a
Ki
3500±n/a nM
Comments
extracted
Citation
 Maibaum, JRich, DH Inhibition of porcine pepsin by two substrate analogues containing statine. The effect of histidine at the P2 subsite on the inhibition of aspartic proteinases. J Med Chem 31:625-9 (1988)  
Target
Name:
Cathepsin D
Synonyms:
CATD_HUMAN CTSD Cathepsin D heavy chain Cathepsin D precursor
Type:
Enzyme
Mol. Mass.:
44551.72
Organism:
Homo sapiens (Human)
Description:
Human proCathepsin D (SwissProt accession number P07339) was expressed in Sf9 cells, purified, and autoactivated.
Residue:
412
  
Inhibitor
Name:
BDBM50022515
Synonyms:
CHEMBL3349396 | POA-His-Sta-Leu-PheOMe
Type:
Small organic molecule
Emp. Form.:
C37H56N6O9
Mol. Mass.:
728.8753
SMILES:
COC(=O)[C@H](Cc1ccccc1)NC(=O)[C@H](CC(C)C)NC(=O)CC(O)[C@H](CC(C)C)NC(=O)[C@H](Cc1c[nH]cn1)NC(=O)COC(=O)C(C)(C)C
: