Target
Insulin-degrading enzyme
Ligand
BDBM50459189
Substrate
Meas. Tech.
ChEMBL_1765700 (CHEMBL4200947)
IC50
22±n/a nM
Citation
 Yang, DQin, WShi, XZhu, BXie, MZhao, HTeng, BWu, YZhao, RYin, FRen, PLiu, LLi, Z Stabilized ?-Hairpin Peptide Inhibits Insulin Degrading Enzyme. J Med Chem 61:8174-8185 (2018)  
Target
Name:
Insulin-degrading enzyme
Synonyms:
3.4.24.56 Ide Insulin protease Insulinase Mouse Insulin Degrading Enzyme (mIDE)
Type:
Mol. Mass.:
117770.69
Organism:
Mus musculus (Mouse)
Description:
Q9JHR7
Residue:
1019
  
Inhibitor
Name:
BDBM50459189
Synonyms:
CHEMBL4211248
Type:
Small organic molecule
Emp. Form.:
C88H124N22O23S
Mol. Mass.:
1890.125
SMILES:
CC(C)C[C@H](NC(=O)[C@H](Cc1ccc(O)cc1)NC(=O)[C@H](CC(C)C)NC(=O)[C@@H]1CNC(=O)C[C@H](NC(=O)[C@H](Cc2ccccc2)NC(=O)[C@H](CCCNC(N)=N)NC(=O)[C@H](Cc2c[nH]c3ccccc23)NC(=O)[C@H](CCC(O)=O)NC(C)=O)C(=O)NCC(=O)N2CCC[C@@H]2C(=O)N2CCC[C@H]2C(=O)N[C@@H](CCC(O)=O)C(=O)N1)C(=O)N[C@@H](C(C)C)C(=O)N[C@@H](CS)C(=O)NCC(N)=O
: