Target
Son of sevenless homolog 1
Ligand
BDBM50459472
Substrate
Meas. Tech.
ChEMBL_1766507 (CHEMBL4201754)
Kd
380±n/a nM
Citation
 Hodges, TRAbbott, JRLittle, AJSarkar, DSalovich, JMHowes, JEAkan, DTSai, JArnold, ALBrowning, CBurns, MCSobolik, TSun, QBeesetty, YCoker, JAScharn, DStadtmueller, HRossanese, OWPhan, JWaterson, AGMcConnell, DBFesik, SW Discovery and Structure-Based Optimization of Benzimidazole-Derived Activators of SOS1-Mediated Nucleotide Exchange on RAS. J Med Chem 61:8875-8894 (2018)  
Target
Name:
Son of sevenless homolog 1
Synonyms:
SOS-1 SOS1_HUMAN
Type:
PROTEIN
Mol. Mass.:
152470.33
Organism:
Homo sapiens (Human)
Description:
ChEMBL_839705
Residue:
1333
  
Inhibitor
Name:
BDBM50459472
Synonyms:
CHEMBL4206057
Type:
Small organic molecule
Emp. Form.:
C25H31ClFN5O
Mol. Mass.:
471.998
SMILES:
Cc1cc(Cn2c(nc3c(cc(Cl)cc23)N2CCC[C@@H]2CO)N2CCNCC2)cc(C)c1F
: