Target
Son of sevenless homolog 1
Ligand
BDBM50459449
Substrate
Meas. Tech.
ChEMBL_1766506 (CHEMBL4201753)
Kd
44±n/a nM
Citation
 Hodges, TRAbbott, JRLittle, AJSarkar, DSalovich, JMHowes, JEAkan, DTSai, JArnold, ALBrowning, CBurns, MCSobolik, TSun, QBeesetty, YCoker, JAScharn, DStadtmueller, HRossanese, OWPhan, JWaterson, AGMcConnell, DBFesik, SW Discovery and Structure-Based Optimization of Benzimidazole-Derived Activators of SOS1-Mediated Nucleotide Exchange on RAS. J Med Chem 61:8875-8894 (2018)  
Target
Name:
Son of sevenless homolog 1
Synonyms:
SOS-1 SOS1_HUMAN
Type:
PROTEIN
Mol. Mass.:
152470.33
Organism:
Homo sapiens (Human)
Description:
ChEMBL_839705
Residue:
1333
  
Inhibitor
Name:
BDBM50459449
Synonyms:
CHEMBL4213025
Type:
Small organic molecule
Emp. Form.:
C26H32ClFN6
Mol. Mass.:
483.024
SMILES:
CN1CCN(CC1)c1cc(Cl)cc2n(Cc3cc(C)c(F)c(C)c3)c(nc12)N1CC2(CNC2)C1
: