Target
Son of sevenless homolog 1
Ligand
BDBM50459478
Substrate
Meas. Tech.
ChEMBL_1766507 (CHEMBL4201754)
Kd
210±n/a nM
Citation
 Hodges, TRAbbott, JRLittle, AJSarkar, DSalovich, JMHowes, JEAkan, DTSai, JArnold, ALBrowning, CBurns, MCSobolik, TSun, QBeesetty, YCoker, JAScharn, DStadtmueller, HRossanese, OWPhan, JWaterson, AGMcConnell, DBFesik, SW Discovery and Structure-Based Optimization of Benzimidazole-Derived Activators of SOS1-Mediated Nucleotide Exchange on RAS. J Med Chem 61:8875-8894 (2018)  
Target
Name:
Son of sevenless homolog 1
Synonyms:
SOS-1 SOS1_HUMAN
Type:
PROTEIN
Mol. Mass.:
152470.33
Organism:
Homo sapiens (Human)
Description:
ChEMBL_839705
Residue:
1333
  
Inhibitor
Name:
BDBM50459478
Synonyms:
CHEMBL4206374
Type:
Small organic molecule
Emp. Form.:
C27H28ClFN4
Mol. Mass.:
462.989
SMILES:
Cc1ccccc1-c1cc(Cl)cc2n(Cc3cc(C)c(F)c(C)c3)c(nc12)N1CCNCC1
: