Target
Bromodomain-containing protein 4
Ligand
BDBM50459878
Substrate
Meas. Tech.
ChEMBL_1767415 (CHEMBL4219527)
Kd
3.0±n/a nM
Citation
 Chan, KHZengerle, MTesta, ACiulli, A Impact of Target Warhead and Linkage Vector on Inducing Protein Degradation: Comparison of Bromodomain and Extra-Terminal (BET) Degraders Derived from Triazolodiazepine (JQ1) and Tetrahydroquinoline (I-BET726) BET Inhibitor Scaffolds. J Med Chem 61:504-513 (2018)  
Target
Name:
Bromodomain-containing protein 4
Synonyms:
BRD4 Bromodomain-containing protein 4 (BRD4) Protein HUNK1
Type:
Protein
Mol. Mass.:
152264.84
Organism:
Homo sapiens (Human)
Description:
O60885
Residue:
1362
  
Inhibitor
Name:
BDBM50459878
Synonyms:
CHEMBL4227834
Type:
Small organic molecule
Emp. Form.:
C53H62ClN7O8S
Mol. Mass.:
992.619
SMILES:
C[C@H]1C[C@@H](Nc2ccc(Cl)cc2)c2cc(ccc2N1C(C)=O)-c1ccc(cc1)C(=O)NCCOCCOCC(=O)N[C@H](C(=O)N1C[C@H](O)C[C@H]1C(=O)NCc1ccc(cc1)-c1scnc1C)C(C)(C)C
: