Target
Probable L-lysine-epsilon aminotransferase
Ligand
BDBM50460477
Substrate
Meas. Tech.
ChEBML_1769547
IC50
3480±n/a nM
Citation
 Alluri, KKReshma, RSSuraparaju, RGottapu, SSriram, D Synthesis and evaluation of 4',5'-dihydrospiro[piperidine-4,7'-thieno[2,3-c]pyran] analogues against both active and dormant Mycobacterium tuberculosis. Bioorg Med Chem 26:1462-1469 (2018)  
Target
Name:
Probable L-lysine-epsilon aminotransferase
Synonyms:
2.6.1.36 LAT_MYCTU Probable L-lysine-epsilon aminotransferase | lat
Type:
PROTEIN
Mol. Mass.:
49007.52
Organism:
Mycobacterium tuberculosis (strain ATCC 25618 / H37Rv)
Description:
ChEMBL_105536
Residue:
449
  
Inhibitor
Name:
BDBM50460477
Synonyms:
CHEMBL4227828
Type:
Small organic molecule
Emp. Form.:
C18H17F2NO2S
Mol. Mass.:
349.395
SMILES:
Fc1ccc(C(=O)N2CCC3(CC2)OCCc2ccsc32)c(F)c1
: