Target
Cytochrome P450 2C9
Ligand
BDBM50460860
Substrate
Meas. Tech.
ChEMBL_1770474 (CHEMBL4222586)
IC50
>50000±n/a nM
Citation
 Ginnetti, ATPaone, DVStauffer, SRPotteiger, CMShaw, AWDeng, JMulhearn, JJNguyen, DNSegerdell, CAnquandah, JCalamari, ACheng, GLeitl, MDLiang, AMoore, EPanigel, JUrban, MWang, JFillgrove, KTang, CCook, SKane, SSalvatore, CAGraham, SLBurgey, CS Identification of second-generation P2X3 antagonists for treatment of pain. Bioorg Med Chem Lett 28:1392-1396 (2018)  
Target
Name:
Cytochrome P450 2C9
Synonyms:
(R)-limonene 6-monooxygenase CP2C9_HUMAN CYP2C9 Cytochrome P450 2C9 (CYP2C9 ) P-450MP P450 PB-1 | S-mephenytoin 4-hydroxylase
Type:
Enzyme
Mol. Mass.:
55636.33
Organism:
Homo sapiens (Human)
Description:
P11712
Residue:
490
  
Inhibitor
Name:
BDBM50460860
Synonyms:
CHEMBL4227903
Type:
Small organic molecule
Emp. Form.:
C24H24F3N3O3
Mol. Mass.:
459.4609
SMILES:
C[C@@H](NC(=O)c1cc(cc(c1)C(C)(C)O)-c1ccc(C)cn1)c1ccc([n+]([O-])c1)C(F)(F)F
: