Target
Nuclear receptor subfamily 1 group I member 2
Ligand
BDBM50460861
Substrate
Meas. Tech.
ChEMBL_1770487 (CHEMBL4222599)
EC50
>30000±n/a nM
Citation
 Ginnetti, ATPaone, DVStauffer, SRPotteiger, CMShaw, AWDeng, JMulhearn, JJNguyen, DNSegerdell, CAnquandah, JCalamari, ACheng, GLeitl, MDLiang, AMoore, EPanigel, JUrban, MWang, JFillgrove, KTang, CCook, SKane, SSalvatore, CAGraham, SLBurgey, CS Identification of second-generation P2X3 antagonists for treatment of pain. Bioorg Med Chem Lett 28:1392-1396 (2018)  
Target
Name:
Nuclear receptor subfamily 1 group I member 2
Synonyms:
NR1I2 Orphan nuclear receptor PAR1 PXR SXR nuclear receptor subfamily 1 group I member 2 isoform 1
Type:
Nuclear receptor
Mol. Mass.:
49774.77
Organism:
Homo sapiens (Human)
Description:
O75469
Residue:
434
  
Inhibitor
Name:
BDBM50460861
Synonyms:
CHEMBL4229237
Type:
Small organic molecule
Emp. Form.:
C23H21ClF3N3O3
Mol. Mass.:
479.879
SMILES:
C[C@@H](NC(=O)c1cc(cc(c1)C(C)(C)O)-c1ccc(Cl)cn1)c1ccc([n+]([O-])c1)C(F)(F)F
: