Target
Cytochrome P450 2C9
Ligand
BDBM50460863
Substrate
Meas. Tech.
ChEMBL_1770474 (CHEMBL4222586)
IC50
5700±n/a nM
Citation
 Ginnetti, ATPaone, DVStauffer, SRPotteiger, CMShaw, AWDeng, JMulhearn, JJNguyen, DNSegerdell, CAnquandah, JCalamari, ACheng, GLeitl, MDLiang, AMoore, EPanigel, JUrban, MWang, JFillgrove, KTang, CCook, SKane, SSalvatore, CAGraham, SLBurgey, CS Identification of second-generation P2X3 antagonists for treatment of pain. Bioorg Med Chem Lett 28:1392-1396 (2018)  
Target
Name:
Cytochrome P450 2C9
Synonyms:
(R)-limonene 6-monooxygenase CP2C9_HUMAN CYP2C9 Cytochrome P450 2C9 (CYP2C9 ) P-450MP P450 PB-1 | S-mephenytoin 4-hydroxylase
Type:
Enzyme
Mol. Mass.:
55636.33
Organism:
Homo sapiens (Human)
Description:
P11712
Residue:
490
  
Inhibitor
Name:
BDBM50460863
Synonyms:
CHEMBL4227228
Type:
Small organic molecule
Emp. Form.:
C28H24FN5O2
Mol. Mass.:
481.5209
SMILES:
C[C@@H](NC(=O)c1cc(cc(c1)-c1ccc(C)cn1)C1=NO[C@@H](C1)c1ccccn1)c1ccc(F)cn1
: