Target
Nuclear receptor subfamily 1 group I member 2
Ligand
BDBM50460866
Substrate
Meas. Tech.
ChEMBL_1770487 (CHEMBL4222599)
EC50
2000±n/a nM
Citation
 Ginnetti, ATPaone, DVStauffer, SRPotteiger, CMShaw, AWDeng, JMulhearn, JJNguyen, DNSegerdell, CAnquandah, JCalamari, ACheng, GLeitl, MDLiang, AMoore, EPanigel, JUrban, MWang, JFillgrove, KTang, CCook, SKane, SSalvatore, CAGraham, SLBurgey, CS Identification of second-generation P2X3 antagonists for treatment of pain. Bioorg Med Chem Lett 28:1392-1396 (2018)  
Target
Name:
Nuclear receptor subfamily 1 group I member 2
Synonyms:
NR1I2 Orphan nuclear receptor PAR1 PXR SXR nuclear receptor subfamily 1 group I member 2 isoform 1
Type:
Nuclear receptor
Mol. Mass.:
49774.77
Organism:
Homo sapiens (Human)
Description:
O75469
Residue:
434
  
Inhibitor
Name:
BDBM50460866
Synonyms:
CHEMBL4226706
Type:
Small organic molecule
Emp. Form.:
C23H24FN3O2
Mol. Mass.:
393.454
SMILES:
C[C@@H](NC(=O)c1cc(cc(c1)C(C)(C)O)-c1ccc(C)cn1)c1ccc(F)cn1
: