Target
Lysine-specific demethylase 2B
Ligand
BDBM191600
Substrate
Meas. Tech.
ChEMBL_1771185 (CHEMBL4223297)
IC50
630±n/a nM
Citation
 Nie, ZShi, LLai, CO'Connell, SMXu, JStansfield, RKHosfield, DJVeal, JMStafford, JA Structure-based design and discovery of potent and selective KDM5 inhibitors. Bioorg Med Chem Lett 28:1490-1494 (2018)  
Target
Name:
Lysine-specific demethylase 2B
Synonyms:
AA 1-650 FBL10 Homo sapiens lysine demethylase 2B (KDM2B) KDM2B Lysine-specific demethylase 2B NDY1 PCCX2
Type:
Enzyme Catalytic Domain
Mol. Mass.:
152658.35
Organism:
Homo sapiens (Human)
Description:
Q8NHM5
Residue:
1336
  
Inhibitor
Name:
BDBM191600
Synonyms:
2-(5-((4-chloro-2-methylbenzyl)oxy)-1Hpyrazol-1-yl)isonicotinic acid (N19) US9604961, Example 89 US9908865, Example 89
Type:
Small organic molecule
Emp. Form.:
C17H14ClN3O3
Mol. Mass.:
343.764
SMILES:
Cc1cc(Cl)ccc1COc1ccnn1-c1cc(ccn1)C(O)=O
: