Target
Lysine-specific demethylase 4B
Ligand
BDBM191600
Substrate
Meas. Tech.
ChEMBL_1771188 (CHEMBL4223300)
IC50
170±n/a nM
Citation
 Nie, ZShi, LLai, CO'Connell, SMXu, JStansfield, RKHosfield, DJVeal, JMStafford, JA Structure-based design and discovery of potent and selective KDM5 inhibitors. Bioorg Med Chem Lett 28:1490-1494 (2018)  
Target
Name:
Lysine-specific demethylase 4B
Synonyms:
JHDM3B JmjC domain-containing histone demethylation protein 3B KDM4B KIAA0876
Type:
PROTEIN
Mol. Mass.:
121904.33
Organism:
Homo sapiens (Human)
Description:
ChEMBL_109446
Residue:
1096
  
Inhibitor
Name:
BDBM191600
Synonyms:
2-(5-((4-chloro-2-methylbenzyl)oxy)-1Hpyrazol-1-yl)isonicotinic acid (N19) US9604961, Example 89 US9908865, Example 89
Type:
Small organic molecule
Emp. Form.:
C17H14ClN3O3
Mol. Mass.:
343.764
SMILES:
Cc1cc(Cl)ccc1COc1ccnn1-c1cc(ccn1)C(O)=O
: