Target
Lysine-specific demethylase 4D
Ligand
BDBM191600
Substrate
Meas. Tech.
ChEMBL_1771189 (CHEMBL4223301)
IC50
110±n/a nM
Citation
 Nie, ZShi, LLai, CO'Connell, SMXu, JStansfield, RKHosfield, DJVeal, JMStafford, JA Structure-based design and discovery of potent and selective KDM5 inhibitors. Bioorg Med Chem Lett 28:1490-1494 (2018)  
Target
Name:
Lysine-specific demethylase 4D
Synonyms:
JHDM3D JMJD2D Jumonji domain-containing protein 2D KDM4D_HUMAN | Lysine-specific demethylase 4D
Type:
PROTEIN
Mol. Mass.:
58627.79
Organism:
Homo sapiens (Human)
Description:
ChEMBL_102441
Residue:
523
  
Inhibitor
Name:
BDBM191600
Synonyms:
2-(5-((4-chloro-2-methylbenzyl)oxy)-1Hpyrazol-1-yl)isonicotinic acid (N19) US9604961, Example 89 US9908865, Example 89
Type:
Small organic molecule
Emp. Form.:
C17H14ClN3O3
Mol. Mass.:
343.764
SMILES:
Cc1cc(Cl)ccc1COc1ccnn1-c1cc(ccn1)C(O)=O
: