Target
Cannabinoid receptor 1
Ligand
BDBM50461710
Substrate
Meas. Tech.
ChEMBL_1771903 (CHEMBL4224015)
Ki
0.900000±n/a nM
Citation
 Amato, GSManke, AHarris, DLWiethe, RWVasukuttan, VSnyder, RWLefever, TWCortes, RZhang, YWang, SRunyon, SPMaitra, R Blocking Alcoholic Steatosis in Mice with a Peripherally Restricted Purine Antagonist of the Type 1 Cannabinoid Receptor. J Med Chem 61:4370-4385 (2018)  
Target
Name:
Cannabinoid receptor 1
Synonyms:
CANN6 CB-R CNR CNR1_HUMAN Cannabinoid receptor Cannabinoid receptor 1 (brain)
Type:
G Protein-Coupled Receptor (GPCR)
Mol. Mass.:
52868.96
Organism:
Homo sapiens (Human)
Description:
P21554
Residue:
472
  
Inhibitor
Name:
BDBM50461710
Synonyms:
CHEMBL4225147
Type:
Small organic molecule
Emp. Form.:
C28H23Cl3N6
Mol. Mass.:
549.881
SMILES:
Clc1ccc(cc1)-n1c(nc2c(ncnc12)N1CCN(Cc2cccc(Cl)c2)CC1)-c1ccccc1Cl
: