Target
Complement C1s subcomponent
Ligand
BDBM50462110
Substrate
Meas. Tech.
ChEMBL_1772699 (CHEMBL4229691)
Ki
6.0±n/a nM
Citation
 Iyer, AXu, WReid, RCFairlie, DP Chemical Approaches to Modulating Complement-Mediated Diseases. J Med Chem 61:3253-3276 (2018)  
Target
Name:
Complement C1s subcomponent
Synonyms:
C1 esterase C1S_HUMAN Complement C1s subcomponent Complement C1s subcomponent light chain Trypsin | complement component 1, s subcomponent
Type:
Protein
Mol. Mass.:
76657.91
Organism:
Homo sapiens (Human)
Description:
P09871
Residue:
688
  
Inhibitor
Name:
BDBM50462110
Synonyms:
CHEMBL4244141
Type:
Small organic molecule
Emp. Form.:
C19H16N2O3S3
Mol. Mass.:
416.537
SMILES:
CSc1sc(cc1S(=O)(=O)c1cccc(c1)-c1cccc(C=O)c1)C(N)=N
: