Target
Complement C1s subcomponent
Ligand
BDBM50462111
Substrate
Meas. Tech.
ChEMBL_1772699 (CHEMBL4229691)
Ki
30±n/a nM
Citation
 Iyer, AXu, WReid, RCFairlie, DP Chemical Approaches to Modulating Complement-Mediated Diseases. J Med Chem 61:3253-3276 (2018)  
Target
Name:
Complement C1s subcomponent
Synonyms:
C1 esterase C1S_HUMAN Complement C1s subcomponent Complement C1s subcomponent light chain Trypsin | complement component 1, s subcomponent
Type:
Protein
Mol. Mass.:
76657.91
Organism:
Homo sapiens (Human)
Description:
P09871
Residue:
688
  
Inhibitor
Name:
BDBM50462111
Synonyms:
CHEMBL4239924
Type:
Small organic molecule
Emp. Form.:
C21H16F2N4O2S4
Mol. Mass.:
522.634
SMILES:
CSc1sc(cc1-c1nc(cs1)-c1cccc(NS(=O)(=O)c2ccc(F)cc2F)c1)C(N)=N
: