Target
Membrane-associated tyrosine- and threonine-specific cdc2-inhibitory kinase
Ligand
BDBM50240826
Substrate
Meas. Tech.
ChEMBL_1776144 (CHEMBL4233136)
IC50
4940±n/a nM
Citation
 Platzer, CNajjar, ARohe, AErdmann, FSippl, WSchmidt, M Identification of PKMYT1 inhibitors by screening the GSK published protein kinase inhibitor set I and II. Bioorg Med Chem 26:4014-4024 (2018)  
Target
Name:
Membrane-associated tyrosine- and threonine-specific cdc2-inhibitory kinase
Synonyms:
MYT1 PMYT1_HUMAN | Tyrosine- and threonine-specific cdc2-inhibitory kinase
Type:
PROTEIN
Mol. Mass.:
54523.76
Organism:
Homo sapiens (Human)
Description:
ChEMBL_587209
Residue:
499
  
Inhibitor
Name:
BDBM50240826
Synonyms:
AZD-1775 US11124518, Example AZD1775 US11479555, Example AZD1775
Type:
Small organic molecule
Emp. Form.:
C27H32N8O2
Mol. Mass.:
500.5954
SMILES:
CN1CCN(CC1)c1ccc(Nc2ncc3c(n2)n(-c2cccc(n2)C(C)(C)O)n(CC=C)c3=O)cc1
: