Target
Alpha-ketoglutarate-dependent dioxygenase alkB homolog 3
Ligand
BDBM50463172
Substrate
Meas. Tech.
ChEMBL_1777818 (CHEMBL4234810)
IC50
>50000±n/a nM
Citation
 Nigam, RBabu, KRGhosh, TKumari, BAkula, DRath, SNDas, PAnindya, RKhan, FA Indenone derivatives as inhibitor of human DNA dealkylation repair enzyme AlkBH3. Bioorg Med Chem 26:4100-4112 (2018)  
Target
Name:
Alpha-ketoglutarate-dependent dioxygenase alkB homolog 3
Synonyms:
ABH3 ALKBH3 DEPC-1 Prostate cancer antigen 1
Type:
PROTEIN
Mol. Mass.:
33382.86
Organism:
Homo sapiens (Human)
Description:
ChEMBL_108024
Residue:
286
  
Inhibitor
Name:
BDBM50463172
Synonyms:
CHEMBL4238139
Type:
Small organic molecule
Emp. Form.:
C29H22O3
Mol. Mass.:
418.4832
SMILES:
COc1ccc(cc1)C1=C(c2cc(ccc2C1=O)-c1ccccc1)c1ccc(OC)cc1
: