Target
Acetyl-CoA carboxylase 2
Ligand
BDBM50365279
Substrate
Meas. Tech.
ChEMBL_1777946 (CHEMBL4234938)
IC50
8.0±n/a nM
Citation
 Wei, QMei, LYang, YMa, HChen, HZhang, HZhou, J Design, synthesis and biological evaluation of novel spiro-pentacylamides as acetyl-CoA carboxylase inhibitors. Bioorg Med Chem 26:3866-3874 (2018)  
Target
Name:
Acetyl-CoA carboxylase 2
Synonyms:
ACACB ACC-beta ACCB Acetyl-CoA carboxylase 2 Acetyl-CoA carboxylase 2 (ACC2)
Type:
Protein
Mol. Mass.:
276535.21
Organism:
Homo sapiens (Human)
Description:
O00763
Residue:
2458
  
Inhibitor
Name:
BDBM50365279
Synonyms:
CHEMBL1958360
Type:
Small organic molecule
Emp. Form.:
C23H27N5O3
Mol. Mass.:
421.4922
SMILES:
Cc1cc(cc2cn[nH]c12)C(=O)N1CCC2(CC1)CC(=O)c1nn(cc1O2)C(C)(C)C
: