Target
Nuclear receptor subfamily 1 group I member 2
Ligand
BDBM50370232
Substrate
Meas. Tech.
ChEMBL_1778217 (CHEMBL4235209)
EC50
2000±n/a nM
Citation
 Toyama, HShirakawa, HKomai, MHashimoto, YFujii, S Development of novel silanol-based human pregnane X receptor (PXR) agonists with improved receptor selectivity. Bioorg Med Chem 26:4493-4501 (2018)  
Target
Name:
Nuclear receptor subfamily 1 group I member 2
Synonyms:
NR1I2 Orphan nuclear receptor PAR1 PXR SXR nuclear receptor subfamily 1 group I member 2 isoform 1
Type:
Nuclear receptor
Mol. Mass.:
49774.77
Organism:
Homo sapiens (Human)
Description:
O75469
Residue:
434
  
Inhibitor
Name:
BDBM50370232
Synonyms:
BA-41166E RIFAMPIN Rifampicin
Type:
Small organic molecule
Emp. Form.:
C43H58N4O12
Mol. Mass.:
822.9402
SMILES:
CO[C@H]1\C=C\O[C@@]2(C)Oc3c(C2=O)c2c(O)c(\C=N\N4CCN(C)CC4)c(NC(=O)\C(C)=C/C=C/[C@H](C)[C@H](O)[C@@H](C)[C@@H](O)[C@@H](C)[C@H](OC(C)=O)[C@@H]1C)c(O)c2c(O)c3C
: