Target
Melatonin receptor type 1A
Ligand
BDBM50464415
Substrate
Meas. Tech.
ChEMBL_1780505 (CHEMBL4252022)
Ki
0.300000±n/a nM
Citation
 Duroux, RRami, MLandagaray, EEttaoussi, MCaignard, DHDelagrange, PMelnyk, PYous, S Synthesis and biological evaluation of new naphtho- and quinolinocyclopentane derivatives as potent melatoninergic (MT Eur J Med Chem 141:552-566 (2017)  
Target
Name:
Melatonin receptor type 1A
Synonyms:
MTNR1A MTR1A_HUMAN Mel1a melatonin receptor Melatonin receptor Melatonin receptor type 1 (MT1) | Melatonin receptor type 1A
Type:
Enzyme
Mol. Mass.:
39392.94
Organism:
Homo sapiens (Human)
Description:
P48039
Residue:
350
  
Inhibitor
Name:
BDBM50464415
Synonyms:
CHEMBL4278575
Type:
Small organic molecule
Emp. Form.:
C16H18N2O2
Mol. Mass.:
270.3263
SMILES:
COc1ccc2ccc3CCC(CNC(N)=O)c3c2c1
: