Target
Melatonin receptor type 1A
Ligand
BDBM50464402
Substrate
Meas. Tech.
ChEMBL_1780505 (CHEMBL4252022)
Ki
0.600000±n/a nM
Citation
 Duroux, RRami, MLandagaray, EEttaoussi, MCaignard, DHDelagrange, PMelnyk, PYous, S Synthesis and biological evaluation of new naphtho- and quinolinocyclopentane derivatives as potent melatoninergic (MT Eur J Med Chem 141:552-566 (2017)  
Target
Name:
Melatonin receptor type 1A
Synonyms:
MTNR1A MTR1A_HUMAN Mel1a melatonin receptor Melatonin receptor Melatonin receptor type 1 (MT1) | Melatonin receptor type 1A
Type:
Enzyme
Mol. Mass.:
39392.94
Organism:
Homo sapiens (Human)
Description:
P48039
Residue:
350
  
Inhibitor
Name:
BDBM50464402
Synonyms:
CHEMBL4279639
Type:
Small organic molecule
Emp. Form.:
C17H20N2O2
Mol. Mass.:
284.3529
SMILES:
CNC(=O)NCC1CCc2ccc3ccc(OC)cc3c12
: