Target
Melatonin receptor type 1B
Ligand
BDBM50464409
Substrate
Meas. Tech.
ChEMBL_1780506 (CHEMBL4252023)
Ki
0.200000±n/a nM
Citation
 Duroux, RRami, MLandagaray, EEttaoussi, MCaignard, DHDelagrange, PMelnyk, PYous, S Synthesis and biological evaluation of new naphtho- and quinolinocyclopentane derivatives as potent melatoninergic (MT Eur J Med Chem 141:552-566 (2017)  
Target
Name:
Melatonin receptor type 1B
Synonyms:
MTNR1B Mel-1B-R Melatonin 1B Melatonin receptor type 1B | Melatonin receptor type 2 (MT2)
Type:
Enzyme
Mol. Mass.:
40203.54
Organism:
Homo sapiens (Human)
Description:
P49286
Residue:
362
  
Inhibitor
Name:
BDBM50464409
Synonyms:
CHEMBL4283539
Type:
Small organic molecule
Emp. Form.:
C16H19N3O2
Mol. Mass.:
285.341
SMILES:
CNC(=O)NCC1CCc2ccc3ccc(OC)nc3c12
: