Target
Melatonin receptor type 1B
Ligand
BDBM50464405
Substrate
Meas. Tech.
ChEMBL_1780506 (CHEMBL4252023)
Ki
0.300±n/a nM
Citation
 Duroux, RRami, MLandagaray, EEttaoussi, MCaignard, DHDelagrange, PMelnyk, PYous, S Synthesis and biological evaluation of new naphtho- and quinolinocyclopentane derivatives as potent melatoninergic (MT Eur J Med Chem 141:552-566 (2017)  
Target
Name:
Melatonin receptor type 1B
Synonyms:
MTNR1B Mel-1B-R Melatonin 1B Melatonin receptor type 1B | Melatonin receptor type 2 (MT2)
Type:
Enzyme
Mol. Mass.:
40203.54
Organism:
Homo sapiens (Human)
Description:
P49286
Residue:
362
  
Inhibitor
Name:
BDBM50464405
Synonyms:
CHEMBL4281915
Type:
Small organic molecule
Emp. Form.:
C17H20N2OS
Mol. Mass.:
300.418
SMILES:
CNC(=S)NCC1CCc2ccc3ccc(OC)cc3c12
: