Target
Estrogen receptor beta
Ligand
BDBM50106635
Substrate
Meas. Tech.
ChEMBL_1784662 (CHEMBL4256179)
EC50
20±n/a nM
Citation
 Hajirahimkhan, AMbachu, OSimmler, CEllis, SGDong, HNikolic, DLankin, DCvan Breemen, RBChen, SNPauli, GFDietz, BMBolton, JL Estrogen Receptor (ER) Subtype Selectivity Identifies 8-Prenylapigenin as an ER? Agonist from Glycyrrhiza inflata and Highlights the Importance of Chemical and Biological Authentication. J Nat Prod 81:966-975 (2018)  
Target
Name:
Estrogen receptor beta
Synonyms:
ER-beta ESR2_HUMAN Estradiol receptor beta (ERβ) Estrogen receptor (ER beta) Estrogen receptor beta (ER beta) NR3A2 estrogen beta
Type:
Protein
Mol. Mass.:
59238.43
Organism:
Homo sapiens (Human)
Description:
Q92731
Residue:
530
  
Inhibitor
Name:
BDBM50106635
Synonyms:
(+/-)-2,3-bis(4-hydroxyphenyl)propanenitrile 2,3-bis(4-hydroxyphenyl)propanenitrile DIARYLPROPIONITRILE
Type:
Small organic molecule
Emp. Form.:
C15H13NO2
Mol. Mass.:
239.2692
SMILES:
Oc1ccc(CC(C#N)c2ccc(O)cc2)cc1
: