Target
Estrogen receptor
Ligand
BDBM50106635
Substrate
Meas. Tech.
ChEMBL_1784660 (CHEMBL4256177)
EC50
80±n/a nM
Citation
 Hajirahimkhan, AMbachu, OSimmler, CEllis, SGDong, HNikolic, DLankin, DCvan Breemen, RBChen, SNPauli, GFDietz, BMBolton, JL Estrogen Receptor (ER) Subtype Selectivity Identifies 8-Prenylapigenin as an ER? Agonist from Glycyrrhiza inflata and Highlights the Importance of Chemical and Biological Authentication. J Nat Prod 81:966-975 (2018)  
Target
Name:
Estrogen receptor
Synonyms:
ER ESR ESR1_HUMAN Estrogen receptor Estrogen receptor (ER-alpha) Estrogen receptor alpha (ER) Nuclear receptor subfamily 3 group A member 1
Type:
Protein
Mol. Mass.:
66230.44
Organism:
Homo sapiens (Human)
Description:
P03372
Residue:
595
  
Inhibitor
Name:
BDBM50106635
Synonyms:
(+/-)-2,3-bis(4-hydroxyphenyl)propanenitrile 2,3-bis(4-hydroxyphenyl)propanenitrile DIARYLPROPIONITRILE
Type:
Small organic molecule
Emp. Form.:
C15H13NO2
Mol. Mass.:
239.2692
SMILES:
Oc1ccc(CC(C#N)c2ccc(O)cc2)cc1
: