Target
Potassium voltage-gated channel subfamily KQT member 3/5
Ligand
BDBM50465779
Substrate
Meas. Tech.
ChEMBL_1788747 (CHEMBL4260481)
EC50
80±n/a nM
Target
Name:
Potassium voltage-gated channel subfamily KQT member 3/5
Synonyms:
Voltage-gated potassium channel KCNQ3/KCNQ5
Type:
Mol. Mass.:
Description:
ASSAY_ID of ChEMBL is 1788747
Components:
This complex has 2 components.
Component 1
Name:
Potassium voltage-gated channel subfamily KQT member 3
Synonyms:
KCNQ (Kv7) potassium channel KCNQ3_HUMAN | Voltage-gated potassium channel subunit Kv7.3
Type:
PROTEIN
Mol. Mass.:
96759.41
Organism:
Homo sapiens (Human)
Description:
ChEMBL_938652
Residue:
872
  
Component 2
Name:
Potassium voltage-gated channel subfamily KQT member 5
Synonyms:
KCNQ (Kv7) potassium channel KCNQ5_HUMAN | Voltage-gated potassium channel subunit Kv7.5
Type:
PROTEIN
Mol. Mass.:
102221.23
Organism:
Homo sapiens (Human)
Description:
ChEMBL_938650
Residue:
932
  
Inhibitor
Name:
BDBM50465779
Synonyms:
CHEMBL4278049
Type:
Small organic molecule
Emp. Form.:
C22H20F5NO5S2
Mol. Mass.:
537.52
SMILES:
CS(=O)(=O)c1cccc(c1)[C@H](CO)NC(=O)c1cc(ccc1Oc1ccccc1)S(F)(F)(F)(F)F
: