Target
Tyrosine-protein kinase JAK3
Ligand
BDBM412674
Substrate
Meas. Tech.
ChEMBL_1789540 (CHEMBL4261274)
IC50
66±n/a nM
Citation
 Elsayed, MSANielsen, JJPark, SPark, JLiu, QKim, CHPommier, YAgama, KLow, PSCushman, M Application of Sequential Palladium Catalysis for the Discovery of Janus Kinase Inhibitors in the Benzo[ c]pyrrolo[2,3- h][1,6]naphthyridin-5-one (BPN) Series. J Med Chem 61:10440-10462 (2018)  
Target
Name:
Tyrosine-protein kinase JAK3
Synonyms:
JAK-3 JAK3_HUMAN Janus kinase 3 (JAK3) L-JAK | Leukocyte janus kinase
Type:
Protein
Mol. Mass.:
125111.08
Organism:
Homo sapiens (Human)
Description:
P52333
Residue:
1124
  
Inhibitor
Name:
BDBM412674
Synonyms:
US10399979, Compound 17a
Type:
Small organic molecule
Emp. Form.:
C22H23N3O3
Mol. Mass.:
377.4363
SMILES:
COc1cc2c3cnc4[nH]ccc4c3n(C3CCCCC3)c(=O)c2cc1OC
: