Target
Bromodomain-containing protein 2
Ligand
BDBM50466254
Substrate
Meas. Tech.
ChEMBL_1792710 (CHEMBL4264629)
Kd
33±n/a nM
Citation
 Yang, SMUrban, DJYoshioka, MStrovel, JWFletcher, SWang, AQXu, XShah, PHu, XHall, MDJadhav, AMaloney, DJ Discovery and lead identification of quinazoline-based BRD4 inhibitors. Bioorg Med Chem Lett 28:3483-3488 (2018)  
Target
Name:
Bromodomain-containing protein 2
Synonyms:
BRD2 Bromodomain and extra-terminal motif (BET) Bromodomain-containing protein 2 (BRD2) RING3
Type:
Protein
Mol. Mass.:
88085.95
Organism:
Homo sapiens (Human)
Description:
P25440
Residue:
801
  
Inhibitor
Name:
BDBM50466254
Synonyms:
CHEMBL4288569
Type:
Small organic molecule
Emp. Form.:
C29H34ClN7O
Mol. Mass.:
532.08
SMILES:
CN(C)CCN1CCN(CC1)c1nc(NCc2cccc(Cl)c2)c2cc(ccc2n1)-c1ccc(=O)n(C)c1
: