Target
Tyrosine-protein kinase JAK3
Ligand
BDBM50466678
Substrate
Meas. Tech.
ChEMBL_1793633 (CHEMBL4265552)
IC50
1.000000±n/a nM
Citation
 Casimiro-Garcia, ATrujillo, JIVajdos, FJuba, BBanker, MEAulabaugh, ABalbo, PBauman, JChrencik, JCoe, JWCzerwinski, RDowty, MKnafels, JDKwon, SLeung, LLiang, SRobinson, RPTelliez, JBUnwalla, RYang, XThorarensen, A Identification of Cyanamide-Based Janus Kinase 3 (JAK3) Covalent Inhibitors. J Med Chem 61:10665-10699 (2018)  
Target
Name:
Tyrosine-protein kinase JAK3
Synonyms:
JAK-3 JAK3_HUMAN Janus kinase 3 (JAK3) L-JAK | Leukocyte janus kinase
Type:
Protein
Mol. Mass.:
125111.08
Organism:
Homo sapiens (Human)
Description:
P52333
Residue:
1124
  
Inhibitor
Name:
BDBM50466678
Synonyms:
CHEMBL4288935
Type:
Small organic molecule
Emp. Form.:
C19H20N6O3S
Mol. Mass.:
412.465
SMILES:
COCCS(=O)(=O)N[C@@H]1C[C@H](NC#N)c2cc(ccc12)-c1ncnc2[nH]ccc12
: