Target
Tyrosine-protein kinase JAK2
Ligand
BDBM50466678
Substrate
Meas. Tech.
ChEMBL_1793637 (CHEMBL4265556)
IC50
>10000±n/a nM
Citation
 Casimiro-Garcia, ATrujillo, JIVajdos, FJuba, BBanker, MEAulabaugh, ABalbo, PBauman, JChrencik, JCoe, JWCzerwinski, RDowty, MKnafels, JDKwon, SLeung, LLiang, SRobinson, RPTelliez, JBUnwalla, RYang, XThorarensen, A Identification of Cyanamide-Based Janus Kinase 3 (JAK3) Covalent Inhibitors. J Med Chem 61:10665-10699 (2018)  
Target
Name:
Tyrosine-protein kinase JAK2
Synonyms:
JAK-2 JAK2_HUMAN Janus kinase 2 (JAK2) | Janus kinase 2 (a protein tyrosine kinase)
Type:
Protein
Mol. Mass.:
130684.68
Organism:
Homo sapiens (Human)
Description:
O60674
Residue:
1132
  
Inhibitor
Name:
BDBM50466678
Synonyms:
CHEMBL4288935
Type:
Small organic molecule
Emp. Form.:
C19H20N6O3S
Mol. Mass.:
412.465
SMILES:
COCCS(=O)(=O)N[C@@H]1C[C@H](NC#N)c2cc(ccc12)-c1ncnc2[nH]ccc12
: