Target
Tyrosine-protein kinase JAK1
Ligand
BDBM50466684
Substrate
Meas. Tech.
ChEMBL_1793634 (CHEMBL4265553)
IC50
105±n/a nM
Citation
 Casimiro-Garcia, ATrujillo, JIVajdos, FJuba, BBanker, MEAulabaugh, ABalbo, PBauman, JChrencik, JCoe, JWCzerwinski, RDowty, MKnafels, JDKwon, SLeung, LLiang, SRobinson, RPTelliez, JBUnwalla, RYang, XThorarensen, A Identification of Cyanamide-Based Janus Kinase 3 (JAK3) Covalent Inhibitors. J Med Chem 61:10665-10699 (2018)  
Target
Name:
Tyrosine-protein kinase JAK1
Synonyms:
JAK-1 JAK1A JAK1_HUMAN Janus kinase 1 (JAK1) | Janus kinase 1 JAK1
Type:
Protein
Mol. Mass.:
133293.73
Organism:
Homo sapiens (Human)
Description:
P23458
Residue:
1154
  
Inhibitor
Name:
BDBM50466684
Synonyms:
CHEMBL4281693
Type:
Small organic molecule
Emp. Form.:
C16H13N5O
Mol. Mass.:
291.3073
SMILES:
O[C@@H]1Cc2ccc(cc2[C@H]1NC#N)-c1ncnc2[nH]ccc12
: