Target
BDNF/NT-3 growth factors receptor
Ligand
BDBM50018830
Substrate
Meas. Tech.
ChEMBL_1794146 (CHEMBL4266263)
Ki
23±n/a nM
Citation
 Basit, SAshraf, ZLee, KLatif, M First macrocyclic 3 Eur J Med Chem 134:348-356 (2017)  
Target
Name:
BDNF/NT-3 growth factors receptor
Synonyms:
GP145-TrkB NTRK2 Neurotrophic tyrosine kinase receptor type 2 Trk-B Tropomyosin-related kinase B Tyrosine kinase receptor B (Trk-B)
Type:
Enzyme
Mol. Mass.:
91996.87
Organism:
Homo sapiens (Human)
Description:
Q16620
Residue:
822
  
Inhibitor
Name:
BDBM50018830
Synonyms:
CHEMBL3286830 US10780082, Compound PF-06463922 | US11517561, Compound PF-06463922
Type:
Small organic molecule
Emp. Form.:
C21H19FN6O2
Mol. Mass.:
406.413
SMILES:
C[C@H]1Oc2cc(cnc2N)-c2c(CN(C)C(=O)c3ccc(F)cc13)nn(C)c2C#N
: