Target
Prostaglandin G/H synthase 2
Ligand
BDBM50467994
Substrate
Meas. Tech.
ChEMBL_1797540 (CHEMBL4269657)
IC50
12610±n/a nM
Citation
 Meleddu, RDistinto, SCottiglia, FAngius, RGaspari, MTaverna, DMelis, CAngeli, ABianco, GDeplano, SFois, BDel Prete, SCapasso, CAlcaro, SOrtuso, FYanez, MSupuran, CTMaccioni, E Tuning the Dual Inhibition of Carbonic Anhydrase and Cyclooxygenase by Dihydrothiazole Benzensulfonamides. ACS Med Chem Lett 9:1045-1050 (2018)  
Target
Name:
Prostaglandin G/H synthase 2
Synonyms:
COX2 Cyclooxygenase 2 (COX-2) Cyclooxygenase-2 (COX-2 AA) Cyclooxygenase-2 (COX-2) PGH2_HUMAN PHS II Prostaglandin E synthase/G/H synthase 2 Prostaglandin-endoperoxide synthase 2
Type:
Enzyme
Mol. Mass.:
69003.89
Organism:
Homo sapiens (Human)
Description:
Recombinant Cox-2 provided by Cayman (Cayman Chemical Co.,Ann Arbor, MI).
Residue:
604
  
Inhibitor
Name:
BDBM50467994
Synonyms:
CHEMBL4279217
Type:
Small organic molecule
Emp. Form.:
C19H15N3O2S3
Mol. Mass.:
413.536
SMILES:
NS(=O)(=O)c1ccc(cc1)\N=c1/scc(-c2cccs2)n1-c1ccccc1
: