Target
Carbonic anhydrase 1
Ligand
BDBM50467990
Substrate
Meas. Tech.
ChEMBL_1797533 (CHEMBL4269650)
Ki
490±n/a nM
Citation
 Meleddu, RDistinto, SCottiglia, FAngius, RGaspari, MTaverna, DMelis, CAngeli, ABianco, GDeplano, SFois, BDel Prete, SCapasso, CAlcaro, SOrtuso, FYanez, MSupuran, CTMaccioni, E Tuning the Dual Inhibition of Carbonic Anhydrase and Cyclooxygenase by Dihydrothiazole Benzensulfonamides. ACS Med Chem Lett 9:1045-1050 (2018)  
Target
Name:
Carbonic anhydrase 1
Synonyms:
CA-I CAB Carbonate dehydratase I Carbonic anhydrase 1 (CA I) Carbonic anhydrase 1 (Recombinant CA I) Carbonic anhydrase B Carbonic anhydrase I (CA I) Carbonic anhydrase I (CAI) Carbonic anhydrase isoenzyme I (hCA I) | hCA
Type:
Enzyme
Mol. Mass.:
28873.37
Organism:
Homo sapiens (Human)
Description:
P00915
Residue:
261
  
Inhibitor
Name:
BDBM50467990
Synonyms:
CHEMBL4293285
Type:
Small organic molecule
Emp. Form.:
C21H16ClN3O2S2
Mol. Mass.:
441.954
SMILES:
NS(=O)(=O)c1ccc(cc1)\N=c1/scc(-c2ccc(Cl)cc2)n1-c1ccccc1
: