Target
Carbonic anhydrase 9
Ligand
BDBM50467994
Substrate
Meas. Tech.
ChEMBL_1797535 (CHEMBL4269652)
Ki
3430±n/a nM
Citation
 Meleddu, RDistinto, SCottiglia, FAngius, RGaspari, MTaverna, DMelis, CAngeli, ABianco, GDeplano, SFois, BDel Prete, SCapasso, CAlcaro, SOrtuso, FYanez, MSupuran, CTMaccioni, E Tuning the Dual Inhibition of Carbonic Anhydrase and Cyclooxygenase by Dihydrothiazole Benzensulfonamides. ACS Med Chem Lett 9:1045-1050 (2018)  
Target
Name:
Carbonic anhydrase 9
Synonyms:
CA-IX CAH9_HUMAN Carbonic anhydrase 9 (CA IX) Carbonic anhydrase 9 precursor Carbonic anhydrase IX (CAIX) Carbonic anhydrases; II & IX MN RCC-associated antigen G250
Type:
Enzyme
Mol. Mass.:
49669.03
Organism:
Homo sapiens (Human)
Description:
Catalytic domain of human cloned isozyme was used in the assay
Residue:
459
  
Inhibitor
Name:
BDBM50467994
Synonyms:
CHEMBL4279217
Type:
Small organic molecule
Emp. Form.:
C19H15N3O2S3
Mol. Mass.:
413.536
SMILES:
NS(=O)(=O)c1ccc(cc1)\N=c1/scc(-c2cccs2)n1-c1ccccc1
: