Target
Lysine-specific demethylase 6A
Ligand
BDBM50468053
Substrate
Meas. Tech.
ChEMBL_1797930 (CHEMBL4270047)
IC50
55000±n/a nM
Citation
 Horton, JRWoodcock, CBChen, QLiu, XZhang, XShanks, JRai, GMott, BTJansen, DJKales, SCHenderson, MJCyr, MPohida, KHu, XShah, PXu, XJadhav, AMaloney, DJHall, MDSimeonov, AFu, HVertino, PMCheng, X Structure-Based Engineering of Irreversible Inhibitors against Histone Lysine Demethylase KDM5A. J Med Chem 61:10588-10601 (2018)  
Target
Name:
Lysine-specific demethylase 6A
Synonyms:
Histone demethylase UTX KDM6A_HUMAN Lysine-specific demethylase 6A (KDM6A(UTX)) UTX Ubiquitously-transcribed X chromosome tetratricopeptide repeat protein
Type:
Protein
Mol. Mass.:
154198.48
Organism:
Homo sapiens (Human)
Description:
O15550
Residue:
1401
  
Inhibitor
Name:
BDBM50468053
Synonyms:
CHEMBL4294426
Type:
Small organic molecule
Emp. Form.:
C19H24N6O4S
Mol. Mass.:
432.497
SMILES:
OC(=O)CCNc1cc(nc(n1)-c1ccccn1)N1CCCN(CC1)S(=O)(=O)C=C
: