Target
Lysine-specific demethylase 6A
Ligand
BDBM60875
Substrate
Meas. Tech.
ChEMBL_1797930 (CHEMBL4270047)
IC50
69000±n/a nM
Citation
 Horton, JRWoodcock, CBChen, QLiu, XZhang, XShanks, JRai, GMott, BTJansen, DJKales, SCHenderson, MJCyr, MPohida, KHu, XShah, PXu, XJadhav, AMaloney, DJHall, MDSimeonov, AFu, HVertino, PMCheng, X Structure-Based Engineering of Irreversible Inhibitors against Histone Lysine Demethylase KDM5A. J Med Chem 61:10588-10601 (2018)  
Target
Name:
Lysine-specific demethylase 6A
Synonyms:
Histone demethylase UTX KDM6A_HUMAN Lysine-specific demethylase 6A (KDM6A(UTX)) UTX Ubiquitously-transcribed X chromosome tetratricopeptide repeat protein
Type:
Protein
Mol. Mass.:
154198.48
Organism:
Homo sapiens (Human)
Description:
O15550
Residue:
1401
  
Inhibitor
Name:
BDBM60875
Synonyms:
3-((6-(4,5-Dihydro-1H-benzo[d]azepin-3(2H)-yl)-2-(pyridin-2-yl)pyrimidin-4-yl)amino)propanoic acid GSK J1 GSKJ1
Type:
Emp. Form.:
C22H23N5O2
Mol. Mass.:
389.4503
SMILES:
OC(=O)CCNc1cc(nc(n1)-c1ccccn1)N1CCc2ccccc2CC1
: