Target
Dopamine beta-hydroxylase
Ligand
BDBM50026188
Substrate
Meas. Tech.
ChEBML_59141
Ki
13000000±n/a nM
Citation
 Bargar, TMBroersma, RJCreemer, LCMcCarthy, JRHornsperger, JMPalfreyman, MGWagner, JJung, MJ Unsaturated heterocyclic amines as potent time-dependent inhibitors of dopamine beta-hydroxylase. J Med Chem 29:315-7 (1986)  
Target
Name:
Dopamine beta-hydroxylase
Synonyms:
DBH | DOPO_BOVIN
Type:
PROTEIN
Mol. Mass.:
68136.39
Organism:
Bos taurus
Description:
ChEMBL_50738
Residue:
610
  
Inhibitor
Name:
BDBM50026188
Synonyms:
2-Phenyl-allylamine | CHEMBL89394
Type:
Small organic molecule
Emp. Form.:
C9H11N
Mol. Mass.:
133.1903
SMILES:
NCC(=C)c1ccccc1
: