Target
Fatty acid-binding protein, adipocyte
Ligand
BDBM50197093
Substrate
Meas. Tech.
ChEMBL_1799370 (CHEMBL4271662)
Ki
87±n/a nM
Citation
 Gao, DDDou, HXSu, HXZhang, MMWang, TLiu, QFCai, HYDing, HPYang, ZZhu, WLXu, YCWang, HYLi, YX From hit to lead: Structure-based discovery of naphthalene-1-sulfonamide derivatives as potent and selective inhibitors of fatty acid binding protein 4. Eur J Med Chem 154:44-59 (2018)  
Target
Name:
Fatty acid-binding protein, adipocyte
Synonyms:
A-FABP ALBP FABP4 Fatty acid binding protein adipocyte Fatty acid-binding protein 4 (FABP4)
Type:
Enzyme
Mol. Mass.:
14719.23
Organism:
Homo sapiens (Human)
Description:
P15090
Residue:
132
  
Inhibitor
Name:
BDBM50197093
Synonyms:
CHEMBL3959018
Type:
Small organic molecule
Emp. Form.:
C21H19ClN6
Mol. Mass.:
390.869
SMILES:
Clc1ccc2nc(N3CCCCC3)c(-c3nnn[nH]3)c(-c3ccccc3)c2c1
: