Target
Tartrate-resistant acid phosphatase type 5
Ligand
BDBM63710
Substrate
Meas. Tech.
ChEMBL_1802620 (CHEMBL4274912)
Ki
190000±n/a nM
Citation
 Hussein, WMFeder, DSchenk, GGuddat, LWMcGeary, RP Purple acid phosphatase inhibitors as leads for osteoporosis chemotherapeutics. Eur J Med Chem 157:462-479 (2018)  
Target
Name:
Tartrate-resistant acid phosphatase type 5
Synonyms:
3.1.3.2 PPA5_PIG Tartrate-resistant acid ATPase TrATPase Uteroferrin
Type:
PROTEIN
Mol. Mass.:
38029.68
Organism:
Sus scrofa
Description:
ChEMBL_117953
Residue:
340
  
Inhibitor
Name:
BDBM63710
Synonyms:
2-phenyl-1,3-thiazole-4-carboxylic acid 2-phenylthiazole-4-carboxylic acid SMR000364704 | cid_138928
Type:
Small organic molecule
Emp. Form.:
C10H7NO2S
Mol. Mass.:
205.233
SMILES:
OC(=O)c1csc(n1)-c1ccccc1
: